pastebin - collaborative debugging

pastebin is a collaborative debugging tool allowing you to share and modify code snippets while chatting on IRC, IM or a message board.

This site is developed to XHTML and CSS2 W3C standards. If you see this paragraph, your browser does not support those standards and you need to upgrade. Visit WaSP for a variety of options.

pastebin private pastebin - collaborative debugging tool What's a private pastebin?

Posted by frymaster on Thu 17th Dec 06:14
View followups from OlegPiene and KostyaPiene | download | new post

  1. localhost@rigel:~/mumble-1.2.0$ qmake main.pro
  2. localhost@rigel:~/mumble-1.2.0$ make
  3. cd speexbuild/ && make -f Makefile
  4. make[1]: Entering directory `/home/localhost/python/mumble/mumblehack/mumble-1.2.0/speexbuild'
  5. make -f Makefile.Release
  6. make[2]: Entering directory `/home/localhost/python/mumble/mumblehack/mumble-1.2.0/speexbuild'
  7. make[2]: Nothing to be done for `first'.
  8. make[2]: Leaving directory `/home/localhost/python/mumble/mumblehack/mumble-1.2.0/speexbuild'
  9. make[1]: Leaving directory `/home/localhost/python/mumble/mumblehack/mumble-1.2.0/speexbuild'
  10. cd celt-0.7.0-build/ && make -f Makefile
  11. make[1]: Entering directory `/home/localhost/python/mumble/mumblehack/mumble-1.2.0/celt-0.7.0-build'
  12. make -f Makefile.Release
  13. make[2]: Entering directory `/home/localhost/python/mumble/mumblehack/mumble-1.2.0/celt-0.7.0-build'
  14. make[2]: Nothing to be done for `first'.
  15. make[2]: Leaving directory `/home/localhost/python/mumble/mumblehack/mumble-1.2.0/celt-0.7.0-build'
  16. make[1]: Leaving directory `/home/localhost/python/mumble/mumblehack/mumble-1.2.0/celt-0.7.0-build'
  17. cd src/mumble11x/ && make -f Makefile
  18. make[1]: Entering directory `/home/localhost/python/mumble/mumblehack/mumble-1.2.0/src/mumble11x'
  19. make -f Makefile.Release
  20. make[2]: Entering directory `/home/localhost/python/mumble/mumblehack/mumble-1.2.0/src/mumble11x'
  21. g++ -pipe -Wfatal-errors -Wshadow -Woverloaded-virtual -Wold-style-cast -Wconversion -Wsign-compare -fvisibility=hidden -Wall -Wextra -I../../speex/include -I../../speexbuild -O2 -I../../speex/include -I../../speexbuild -Wall -W -D_REENTRANT -DRESTRICT=__restrict__ -D_FORTIFY_SOURCE=2 -DMUMBLE_VERSION_STRING=1.1.8 -DMUMBLE_VERSION=1.1.x -DCOMPAT_CLIENT -DUSE_ALSA -DUSE_OSS -DUSE_DBUS -DUSE_SPEECHD -DNO_UPDATE_CHECK -DQT_NO_DEBUG -DQT_SQL_LIB -DQT_XML_LIB -DQT_OPENGL_LIB -DQT_GUI_LIB -DQT_NETWORK_LIB -DQT_CORE_LIB -DQT_SHARED -I/usr/share/qt4/mkspecs/linux-g++ -I. -I/usr/include/qt4/QtCore -I/usr/include/qt4/QtCore -I/usr/include/qt4/QtNetwork -I/usr/include/qt4/QtNetwork -I/usr/include/qt4/QtGui -I/usr/include/qt4/QtGui -I/usr/include/qt4/QtOpenGL -I/usr/include/qt4/QtXml -I/usr/include/qt4/QtXml -I/usr/include/qt4/QtSql -I/usr/include/qt4/QtSql -I/usr/include/qt4 -I/usr/include/qt4/QtDBus -I.. -I../../speex/include -I../../speex/libspeex -I../../speexbuild -I/usr/lib/oss/include -Irelease -I/usr/X11R6/include -I. -x c++-header -c mumble_pch.hpp -o release/mumble11x.gch/c++
  22. mumble_pch.hpp:34:29: error: QtOpenGL/QtOpenGL: No such file or directory
  23. mumble_pch.hpp:65:47: error: boost/accumulators/accumulators.hpp: No such file or directory
  24. mumble_pch.hpp:66:51: error: boost/accumulators/statistics/stats.hpp: No such file or directory
  25. mumble_pch.hpp:67:50: error: boost/accumulators/statistics/mean.hpp: No such file or directory
  26. mumble_pch.hpp:68:54: error: boost/accumulators/statistics/variance.hpp: No such file or directory
  27. mumble_pch.hpp:69:63: error: boost/accumulators/statistics/extended_p_square.hpp: No such file or directory
  28. In file included from /usr/include/qt4/QtSql/QtSql:13,
  29.                  from mumble_pch.hpp:35:
  30. /usr/include/qt4/QtSql/qsqlrelationaldelegate.h: In constructor ‘QSqlRelationalDelegate::QSqlRelationalDelegate(QObject*)’:
  31. /usr/include/qt4/QtSql/qsqlrelationaldelegate.h:65: warning: declaration of ‘parent’ shadows a member of 'this'
  32. /usr/include/qt4/QtSql/qsqlrelationaldelegate.h: In member function ‘virtual QWidget* QSqlRelationalDelegate::createEditor(QWidget*, const QStyleOptionViewItem&, const QModelIndex&) const’:
  33. /usr/include/qt4/QtSql/qsqlrelationaldelegate.h:74: warning: declaration of ‘parent’ shadows a member of 'this'
  34. make[2]: *** [release/mumble11x.gch/c++] Error 1
  35. make[2]: Leaving directory `/home/localhost/python/mumble/mumblehack/mumble-1.2.0/src/mumble11x'
  36. make[1]: *** [release] Error 2
  37. make[1]: Leaving directory `/home/localhost/python/mumble/mumblehack/mumble-1.2.0/src/mumble11x'
  38. make: *** [sub-src-mumble11x-make_default-ordered] Error 2

Submit a correction or amendment below. (click here to make a fresh posting)
After submitting an amendment, you'll be able to view the differences between the old and new posts easily.

Use syntax highlighting

To highlight particular lines, prefix each line with @@


Remember my settings